Reaction Details
TargetMetabotropic glutamate receptor 1
LigandBDBM50301809
Substrate/Competitorn/a
Meas. Tech.ChEMBL_598101 (CHEMBL1038283)
IC50 33±n/a nM
Citation Ito, SHirata, YNagatomi, YSatoh, ASuzuki, GKimura, TSatow, AMaehara, SHikichi, HHata, MOhta, HKawamoto, H Discovery and biological profile of isoindolinone derivatives as novel metabotropic glutamate receptor 1 antagonists: a potential treatment for psychotic disorders. Bioorg Med Chem Lett19:5310-3 (2009) 
 
Metabotropic glutamate receptor 1
Name:Metabotropic glutamate receptor 1
Type:Enzyme
Mol. Mass.:132358.19
Organism:Homo sapiens (Human)
Description:Q13255
Residue:1194
BDBM50301809
NameBDBM50301809
Synonyms:CHEMBL568449 | isopropyl 4-(5-methyl-1-(pyridin-3-yl)-1H-1,2,3-triazol-4-yl)benzoate
TypeSmall organic molecule
Emp. Form.C18H18N4O2
Mol. Mass.322.3611
SMILESCC(C)OC(=O)c1ccc(cc1)-c1nnn(c1C)-c1cccnc1