Reaction Details
TargetMetabotropic glutamate receptor 1
LigandBDBM50301816
Substrate/Competitorn/a
Meas. Tech.ChEMBL_598101 (CHEMBL1038283)
IC50 2.6±n/a nM
Citation Ito, SHirata, YNagatomi, YSatoh, ASuzuki, GKimura, TSatow, AMaehara, SHikichi, HHata, MOhta, HKawamoto, H Discovery and biological profile of isoindolinone derivatives as novel metabotropic glutamate receptor 1 antagonists: a potential treatment for psychotic disorders. Bioorg Med Chem Lett19:5310-3 (2009) 
 
Metabotropic glutamate receptor 1
Name:Metabotropic glutamate receptor 1
Type:Enzyme
Mol. Mass.:132358.19
Organism:Homo sapiens (Human)
Description:Q13255
Residue:1194
BDBM50301816
NameBDBM50301816
Synonyms:2-cyclopropyl-5-(5-methyl-1-(pyridin-3-yl)-1H-1,2,3-triazol-4-yl)-2,3-dihydro-1H-inden-1-one | CHEMBL565943
TypeSmall organic molecule
Emp. Form.C20H18N4O
Mol. Mass.330.3831
SMILESCc1c(nnn1-c1cccnc1)-c1ccc2C(=O)C(Cc2c1)C1CC1