Reaction Details
TargetMetabotropic glutamate receptor 1
LigandBDBM50301822
Substrate/Competitorn/a
Meas. Tech.ChEMBL_598101 (CHEMBL1038283)
IC50 3.6±n/a nM
Citation Ito, SHirata, YNagatomi, YSatoh, ASuzuki, GKimura, TSatow, AMaehara, SHikichi, HHata, MOhta, HKawamoto, H Discovery and biological profile of isoindolinone derivatives as novel metabotropic glutamate receptor 1 antagonists: a potential treatment for psychotic disorders. Bioorg Med Chem Lett19:5310-3 (2009) 
 
Metabotropic glutamate receptor 1
Name:Metabotropic glutamate receptor 1
Type:Enzyme
Mol. Mass.:132358.19
Organism:Homo sapiens (Human)
Description:Q13255
Residue:1194
BDBM50301822
NameBDBM50301822
Synonyms:5-(1-(2-fluoropyridin-3-yl)-5-methyl-1H-1,2,3-triazol-4-yl)-2-propylisoindolin-1-one CHEMBL568443
TypeSmall organic molecule
Emp. Form.C19H18FN5O
Mol. Mass.351.3775
SMILESCCCN1Cc2cc(ccc2C1=O)-c1nnn(c1C)-c1cccnc1F