Reaction Details
TargetMetabotropic glutamate receptor 1
LigandBDBM50301804
Substrate/Competitorn/a
Meas. Tech.ChEMBL_598188 (CHEMBL1045182)
IC50 3.6±n/a nM
Citation Ito, SHirata, YNagatomi, YSatoh, ASuzuki, GKimura, TSatow, AMaehara, SHikichi, HHata, MOhta, HKawamoto, H Discovery and biological profile of isoindolinone derivatives as novel metabotropic glutamate receptor 1 antagonists: a potential treatment for psychotic disorders. Bioorg Med Chem Lett19:5310-3 (2009) 
 
Metabotropic glutamate receptor 1
Name:Metabotropic glutamate receptor 1
Type:Enzyme Catalytic Domain
Mol. Mass.:133240.47
Organism:RAT
Description:metabotropic glutamate 1/2 0 RAT::P23385
Residue:1199
BDBM50301804
NameBDBM50301804
Synonyms:5-(1-(2,4-difluorophenyl)-5-methyl-1H-1,2,3-triazol-4-yl)-2-isopropylisoindolin-1-one | CHEMBL579062
TypeSmall organic molecule
Emp. Form.C20H18F2N4O
Mol. Mass.368.3799
SMILESCC(C)N1Cc2cc(ccc2C1=O)-c1nnn(c1C)-c1ccc(F)cc1F