Reaction Details
TargetGenome polyprotein
LigandBDBM50301906
Substrate/Competitorn/a
Meas. Tech.ChEMBL_598467 (CHEMBL1039991)
IC50 5±n/a nM
Citation de Vicente, JHendricks, RTSmith, DBFell, JBFischer, JSpencer, SRStengel, PJMohr, PRobinson, JEBlake, JFHilgenkamp, RKYee, CZhao, JElworthy, TRTracy, JChin, ELi, JLui, AWang, BOshiro, CHarris, SFGhate, MLeveque, VJNajera, ILe Pogam, SRajyaguru, SAo-Ieong, GAlexandrova, LFitch, BBrandl, MMasjedizadeh, MWu, SYde Keczer, SVoronin, T Non-nucleoside inhibitors of HCV polymerase NS5B. Part 3: synthesis and optimization studies of benzothiazine-substituted tetramic acids. Bioorg Med Chem Lett19:5648-51 (2009) 
 
Genome polyprotein
Name:Genome polyprotein
Type:Enzyme
Mol. Mass.:326966.11
Organism:Hepatitis C virus (HCV)
Description:Q9WMX2
Residue:3010
BDBM50301906
NameBDBM50301906
Synonyms:CHEMBL571606 | N-{3-[(S)-5-tert-Butyl-4-hydroxy-1-(3-methyl-butyl)-2-oxo-2,5-dihydro-1H-pyrrol-3-yl]-1,1-dioxo-1,4-dihydro-1lambda*6*-benzo[1,4]thiazin-7-yl}-methanesulfonamide
TypeSmall organic molecule
Emp. Form.C22H31N3O6S2
Mol. Mass.497.628
SMILESCC(C)CCN1[C@H](C(=O)C(C1=O)C1=Nc2ccc(NS(C)(=O)=O)cc2S(=O)(=O)C1)C(C)(C)C