Reaction Details
TargetGenome polyprotein
LigandBDBM50301914
Substrate/Competitorn/a
Meas. Tech.ChEMBL_598467 (CHEMBL1039991)
IC50 4±n/a nM
Citation de Vicente, JHendricks, RTSmith, DBFell, JBFischer, JSpencer, SRStengel, PJMohr, PRobinson, JEBlake, JFHilgenkamp, RKYee, CZhao, JElworthy, TRTracy, JChin, ELi, JLui, AWang, BOshiro, CHarris, SFGhate, MLeveque, VJNajera, ILe Pogam, SRajyaguru, SAo-Ieong, GAlexandrova, LFitch, BBrandl, MMasjedizadeh, MWu, SYde Keczer, SVoronin, T Non-nucleoside inhibitors of HCV polymerase NS5B. Part 3: synthesis and optimization studies of benzothiazine-substituted tetramic acids. Bioorg Med Chem Lett19:5648-51 (2009) 
 
Genome polyprotein
Name:Genome polyprotein
Type:Enzyme
Mol. Mass.:326966.11
Organism:Hepatitis C virus (HCV)
Description:Q9WMX2
Residue:3010
BDBM50301914
NameBDBM50301914
Synonyms:CHEMBL570249 | N-{2-Acetyl-3-[(S)-5-tert-butyl-1-(4-fluoro-benzyl)-4-hydroxy-2-oxo-2,5-dihydro-1H-pyrrol-3-yl]-1,1-dioxo-1,4-dihydro-1lambda*6*-benzo[1,4]thiazin-7-yl}-methanesulfonamide
TypeSmall organic molecule
Emp. Form.C26H28FN3O7S2
Mol. Mass.577.645
SMILESCC(=O)C1C(=Nc2ccc(NS(C)(=O)=O)cc2S1(=O)=O)C1C(=O)[C@@H](N(Cc2ccc(F)cc2)C1=O)C(C)(C)C