Reaction Details
TargetCalcitonin gene-related peptide type 1 receptor
LigandBDBM50301956
Substrate/Competitorn/a
Meas. Tech.ChEMBL_598692 (CHEMBL1050773)
Ki 1.6±n/a nM
Citation Wood, MRSchirripa, KMKim, JJQuigley, AGStump, CABell, IMBednar, RAFay, JFBruno, JGMoore, ELMosser, SDRoller, SSalvatore, CAKane, SAVacca, JPSelnick, HG Novel CGRP receptor antagonists through a design strategy of target simplification with addition of molecular flexibility. Bioorg Med Chem Lett19:5787-90 (2009) 
 
Calcitonin gene-related peptide type 1 receptor
Name:Calcitonin gene-related peptide type 1 receptor
Type:Enzyme Catalytic Domain
Mol. Mass.:52980.45
Organism:Homo sapiens (Human)
Description:Q16602
Residue:461
BDBM50301956
NameBDBM50301956
Synonyms:(+/-)-N-(3-fluorobenzyl)-N-(2-(3-methyl-2,5-dioxo-1',3'-dihydrospiro[imidazolidine-4,2'-indene]-5'-ylamino)-2-oxoethyl)pivalamide | CHEMBL571580
TypeSmall organic molecule
Emp. Form.C26H29FN4O4
Mol. Mass.480.5313
SMILESCN1C(=O)NC(=O)C11Cc2ccc(NC(=O)CN(Cc3cccc(F)c3)C(=O)C(C)(C)C)cc2C1