Reaction Details
TargetDual specificity mitogen-activated protein kinase kinase 2
LigandBDBM50301964
Substrate/Competitorn/a
Meas. Tech.ChEMBL_598693 (CHEMBL1050774)
Ki 1800±n/a nM
Citation Wood, MRSchirripa, KMKim, JJQuigley, AGStump, CABell, IMBednar, RAFay, JFBruno, JGMoore, ELMosser, SDRoller, SSalvatore, CAKane, SAVacca, JPSelnick, HG Novel CGRP receptor antagonists through a design strategy of target simplification with addition of molecular flexibility. Bioorg Med Chem Lett19:5787-90 (2009) 
 
Dual specificity mitogen-activated protein kinase kinase 2
Name:Dual specificity mitogen-activated protein kinase kinase 2
Type:Enzyme Catalytic Domain
Mol. Mass.:44423.61
Organism:Homo sapiens (Human)
Description:gi_13489054
Residue:400
BDBM50301964
NameBDBM50301964
Synonyms:(S)-N-(3-chloro-5-fluorobenzyl)-N-(2-(3-methyl-2,5-dioxo-1',3'-dihydrospiro[imidazolidine-4,2'-indene]-5'-ylamino)-2-oxoethyl)pivalamide | CHEMBL571797
TypeSmall organic molecule
Emp. Form.C26H28ClFN4O4
Mol. Mass.514.976
SMILESCN1C(=O)NC(=O)[C@@]11Cc2ccc(NC(=O)CN(Cc3cc(F)cc(Cl)c3)C(=O)C(C)(C)C)cc2C1