Reaction Details
TargetC-X-C chemokine receptor type 1
LigandBDBM50302104
Substrate/Competitorn/a
Meas. Tech.ChEMBL_599857 (CHEMBL1043640)
Ki 5200±n/a nM
Citation Liu, SLiu, YWang, HDing, YWu, HDong, JWong, AChen, SHLi, GChan, MSawyer, NGervais, FGHenault, MKargman, SBedard, LLHan, YFriesen, RLobell, RBStout, DM Design, synthesis, and evaluation of novel 3-amino-4-hydrazine-cyclobut-3-ene-1,2-diones as potent and selective CXCR2 chemokine receptor antagonists. Bioorg Med Chem Lett19:5741-5 (2009) 
 
C-X-C chemokine receptor type 1
Name:C-X-C chemokine receptor type 1
Type:Enzyme
Mol. Mass.:39803.83
Organism:Homo sapiens (Human)
Description:P25024
Residue:350
BDBM50302104
NameBDBM50302104
Synonyms:3-(2-(2-ethyl-2-(pyridin-2-yl)hydrazinyl)-3,4-dioxocyclobut-1-enylamino)-2-hydroxy-N,N-dimethylbenzamide | CHEMBL585928
TypeSmall organic molecule
Emp. Form.C20H21N5O4
Mol. Mass.395.4118
SMILESCCN(Nc1c(Nc2cccc(C(=O)N(C)C)c2O)c(=O)c1=O)c1ccccn1