Reaction Details
TargetC-X-C chemokine receptor type 2
LigandBDBM50302103
Substrate/Competitorn/a
Meas. Tech.ChEMBL_599859 (CHEMBL1043642)
IC50 100±n/a nM
Citation Liu, SLiu, YWang, HDing, YWu, HDong, JWong, AChen, SHLi, GChan, MSawyer, NGervais, FGHenault, MKargman, SBedard, LLHan, YFriesen, RLobell, RBStout, DM Design, synthesis, and evaluation of novel 3-amino-4-hydrazine-cyclobut-3-ene-1,2-diones as potent and selective CXCR2 chemokine receptor antagonists. Bioorg Med Chem Lett19:5741-5 (2009) 
 
C-X-C chemokine receptor type 2
Name:C-X-C chemokine receptor type 2
Type:Protein
Mol. Mass.:40767.88
Organism:Homo sapiens (Human)
Description:P25025
Residue:360
BDBM50302103
NameBDBM50302103
Synonyms:3-(2-(2-ethyl-2-(4-methoxyphenyl)hydrazinyl)-3,4-dioxocyclobut-1-enylamino)-2-hydroxy-N,N-dimethylbenzamide | CHEMBL571141
TypeSmall organic molecule
Emp. Form.C22H24N4O5
Mol. Mass.424.4498
SMILESCCN(Nc1c(Nc2cccc(C(=O)N(C)C)c2O)c(=O)c1=O)c1ccc(OC)cc1