Reaction Details
Target5-hydroxytryptamine receptor 2C
LigandBDBM50302160
Substrate/Competitorn/a
Meas. Tech.ChEMBL_598874 (CHEMBL1044706)
EC50 47±n/a nM
Citation Allerton, CMAndrews, MDBlagg, JEllis, DEvrard, EGreen, MPLiu, KKMcMurray, GRalph, MSanderson, VWard, RWatson, L Design and synthesis of pyridazinone-based 5-HT(2C) agonists. Bioorg Med Chem Lett19:5791-5 (2009) 
 
5-hydroxytryptamine receptor 2C
Name:5-hydroxytryptamine receptor 2C
Type:G Protein-Coupled Receptor (GPCR)
Mol. Mass.:51836.79
Organism:Homo sapiens (Human)
Description:P28335
Residue:458
BDBM50302160
NameBDBM50302160
Synonyms:6-(piperazin-1-yl)-2-(2-(2-(trifluoromethyl)phenoxy)ethyl)pyridazin-3(2H)-one | CHEMBL569342
TypeSmall organic molecule
Emp. Form.C17H19F3N4O2
Mol. Mass.368.3536
SMILESFC(F)(F)c1ccccc1OCCn1nc(ccc1=O)N1CCNCC1