Reaction Details
Target5-hydroxytryptamine receptor 2C
LigandBDBM50301772
Substrate/Competitorn/a
Meas. Tech.ChEMBL_598874 (CHEMBL1044706)
EC50 11±n/a nM
Citation Allerton, CMAndrews, MDBlagg, JEllis, DEvrard, EGreen, MPLiu, KKMcMurray, GRalph, MSanderson, VWard, RWatson, L Design and synthesis of pyridazinone-based 5-HT(2C) agonists. Bioorg Med Chem Lett19:5791-5 (2009) 
 
5-hydroxytryptamine receptor 2C
Name:5-hydroxytryptamine receptor 2C
Type:G Protein-Coupled Receptor (GPCR)
Mol. Mass.:51836.79
Organism:Homo sapiens (Human)
Description:P28335
Residue:458
BDBM50301772
NameBDBM50301772
Synonyms:(R)-6-(2-methylpiperazin-1-yl)-2-(2-(2-(trifluoromethyl)phenoxy)ethyl)pyridazin-3(2H)-one | CHEMBL570274
TypeSmall organic molecule
Emp. Form.C18H21F3N4O2
Mol. Mass.382.3801
SMILESC[C@@H]1CNCCN1c1ccc(=O)n(CCOc2ccccc2C(F)(F)F)n1