Reaction Details
TargetUrotensin-2 receptor
LigandBDBM50302250
Substrate/Competitorn/a
Meas. Tech.ChEMBL_596665 (CHEMBL1048827)
IC50 3.5±n/a nM
Citation Lawson, ECLuci, DKGhosh, SKinney, WAReynolds, CHQi, JSmith, CEWang, YMinor, LKHaertlein, BJParry, TJDamiano, BPMaryanoff, BE Nonpeptide urotensin-II receptor antagonists: a new ligand class based on piperazino-phthalimide and piperazino-isoindolinone subunits. J Med Chem52:7432-45 (2009) 
 
Urotensin-2 receptor
Name:Urotensin-2 receptor
Type:Enzyme Catalytic Domain
Mol. Mass.:42725.34
Organism:RAT
Description:Urotensin-II UTS2R RAT::P49684
Residue:386
BDBM50302250
NameBDBM50302250
Synonyms:(R)-N-(4-(3,4-dimethoxyphenyl)-4-(4-(4-isopropylpiperazin-1-yl)-1,3-dioxoisoindolin-2-yl)butyl)thiophene-2-sulfonamide | CHEMBL567736
TypeSmall organic molecule
Emp. Form.C31H38N4O6S2
Mol. Mass.626.787
SMILESCOc1ccc(cc1OC)[C@@H](CCCNS(=O)(=O)c1cccs1)N1C(=O)c2cccc(N3CCN(CC3)C(C)C)c2C1=O