Reaction Details
TargetUrotensin-2 receptor
LigandBDBM50302265
Substrate/Competitorn/a
Meas. Tech.ChEMBL_596665 (CHEMBL1048827)
IC50 13±n/a nM
Citation Lawson, ECLuci, DKGhosh, SKinney, WAReynolds, CHQi, JSmith, CEWang, YMinor, LKHaertlein, BJParry, TJDamiano, BPMaryanoff, BE Nonpeptide urotensin-II receptor antagonists: a new ligand class based on piperazino-phthalimide and piperazino-isoindolinone subunits. J Med Chem52:7432-45 (2009) 
 
Urotensin-2 receptor
Name:Urotensin-2 receptor
Type:Enzyme Catalytic Domain
Mol. Mass.:42725.34
Organism:RAT
Description:Urotensin-II UTS2R RAT::P49684
Residue:386
BDBM50302265
NameBDBM50302265
Synonyms:(R)-N-(4-(4-(4-cyclopropylpiperazin-1-yl)-1-oxoisoindolin-2-yl)-4-(3,4-dimethoxyphenyl)butyl)-N-methylthiophene-2-sulfonamide | CHEMBL578204
TypeSmall organic molecule
Emp. Form.C32H40N4O5S2
Mol. Mass.624.814
SMILESCOc1ccc(cc1OC)[C@@H](CCCN(C)S(=O)(=O)c1cccs1)N1Cc2c(cccc2N2CCN(CC2)C2CC2)C1=O