Reaction Details
TargetUrotensin-2 receptor
LigandBDBM50302270
Substrate/Competitorn/a
Meas. Tech.ChEMBL_596665 (CHEMBL1048827)
IC50 1±n/a nM
Citation Lawson, ECLuci, DKGhosh, SKinney, WAReynolds, CHQi, JSmith, CEWang, YMinor, LKHaertlein, BJParry, TJDamiano, BPMaryanoff, BE Nonpeptide urotensin-II receptor antagonists: a new ligand class based on piperazino-phthalimide and piperazino-isoindolinone subunits. J Med Chem52:7432-45 (2009) 
 
Urotensin-2 receptor
Name:Urotensin-2 receptor
Type:Enzyme Catalytic Domain
Mol. Mass.:42725.34
Organism:RAT
Description:Urotensin-II UTS2R RAT::P49684
Residue:386
BDBM50302270
NameBDBM50302270
Synonyms:(R)-2-(4-(6-chloropyrazin-2-ylamino)-1-(3,4-dimethoxyphenyl)butyl)-4-(4-ethylpiperazin-1-yl)isoindolin-1-one | CHEMBL566056
TypeSmall organic molecule
Emp. Form.C30H37ClN6O3
Mol. Mass.565.106
SMILESCCN1CCN(CC1)c1cccc2C(=O)N(Cc12)[C@H](CCCNc1cncc(Cl)n1)c1ccc(OC)c(OC)c1