Reaction Details
TargetUrotensin-2 receptor
LigandBDBM50302242
Substrate/Competitorn/a
Meas. Tech.ChEMBL_596666 (CHEMBL1048828)
Ki 120±n/a nM
Citation Lawson, ECLuci, DKGhosh, SKinney, WAReynolds, CHQi, JSmith, CEWang, YMinor, LKHaertlein, BJParry, TJDamiano, BPMaryanoff, BE Nonpeptide urotensin-II receptor antagonists: a new ligand class based on piperazino-phthalimide and piperazino-isoindolinone subunits. J Med Chem52:7432-45 (2009) 
 
Urotensin-2 receptor
Name:Urotensin-2 receptor
Type:Enzyme Catalytic Domain
Mol. Mass.:42159.71
Organism:Homo sapiens (Human)
Description:Urotensin-II UTS2R HUMAN::Q9UKP6
Residue:389
BDBM50302242
NameBDBM50302242
Synonyms:CHEMBL565580 | N-((S)-4-(3,4-dimethoxyphenyl)-4-(1,3-dioxo-4-(4-((R)-1-phenylethyl)piperazin-1-yl)isoindolin-2-yl)butyl)thiophene-2-sulfonamide
TypeSmall organic molecule
Emp. Form.C36H40N4O6S2
Mol. Mass.688.856
SMILESCOc1ccc(cc1OC)[C@H](CCCNS(=O)(=O)c1cccs1)N1C(=O)c2cccc(N3CCN(CC3)[C@H](C)c3ccccc3)c2C1=O