Reaction Details
TargetUrotensin-2 receptor
LigandBDBM50302248
Substrate/Competitorn/a
Meas. Tech.ChEMBL_596666 (CHEMBL1048828)
Ki 59±n/a nM
Citation Lawson, ECLuci, DKGhosh, SKinney, WAReynolds, CHQi, JSmith, CEWang, YMinor, LKHaertlein, BJParry, TJDamiano, BPMaryanoff, BE Nonpeptide urotensin-II receptor antagonists: a new ligand class based on piperazino-phthalimide and piperazino-isoindolinone subunits. J Med Chem52:7432-45 (2009) 
 
Urotensin-2 receptor
Name:Urotensin-2 receptor
Type:Enzyme Catalytic Domain
Mol. Mass.:42159.71
Organism:Homo sapiens (Human)
Description:Urotensin-II UTS2R HUMAN::Q9UKP6
Residue:389
BDBM50302248
NameBDBM50302248
Synonyms:(R)-N-(4-(3,4-dimethoxyphenyl)-4-(4-(4-methylpiperazin-1-yl)-1,3-dioxoisoindolin-2-yl)butyl)thiophene-2-sulfonamide | CHEMBL567949
TypeSmall organic molecule
Emp. Form.C29H34N4O6S2
Mol. Mass.598.733
SMILESCOc1ccc(cc1OC)[C@@H](CCCNS(=O)(=O)c1cccs1)N1C(=O)c2cccc(N3CCN(C)CC3)c2C1=O