Reaction Details
TargetUrotensin-2 receptor
LigandBDBM50302269
Substrate/Competitorn/a
Meas. Tech.ChEMBL_596666 (CHEMBL1048828)
Ki 25±n/a nM
Citation Lawson, ECLuci, DKGhosh, SKinney, WAReynolds, CHQi, JSmith, CEWang, YMinor, LKHaertlein, BJParry, TJDamiano, BPMaryanoff, BE Nonpeptide urotensin-II receptor antagonists: a new ligand class based on piperazino-phthalimide and piperazino-isoindolinone subunits. J Med Chem52:7432-45 (2009) 
 
Urotensin-2 receptor
Name:Urotensin-2 receptor
Type:Enzyme Catalytic Domain
Mol. Mass.:42159.71
Organism:Homo sapiens (Human)
Description:Urotensin-II UTS2R HUMAN::Q9UKP6
Residue:389
BDBM50302269
NameBDBM50302269
Synonyms:(R)-N-(4-(3,4-dimethoxyphenyl)-4-(4-(4-ethylpiperazin-1-yl)-1-oxoisoindolin-2-yl)butyl)-1H-imidazole-4-sulfonamide | CHEMBL578207
TypeSmall organic molecule
Emp. Form.C29H38N6O5S
Mol. Mass.582.714
SMILESCCN1CCN(CC1)c1cccc2C(=O)N(Cc12)[C@H](CCCNS(=O)(=O)c1cnc[nH]1)c1ccc(OC)c(OC)c1