Reaction Details
TargetCannabinoid receptor 2
LigandBDBM50302298
Substrate/Competitorn/a
Meas. Tech.ChEMBL_596700 (CHEMBL1049670)
Ki 81±n/a nM
Citation Chu, GHSaeui, CTWorm, KWeaver, DGGoodman, AJBroadrup, RLCassel, JADeHaven, RNLaBuda, CJKoblish, MBrogdon, BSmith, SLe Bourdonnec, BDolle, RE Novel pyridine derivatives as potent and selective CB2 cannabinoid receptor agonists. Bioorg Med Chem Lett19:5931-5 (2009) 
 
Cannabinoid receptor 2
Name:Cannabinoid receptor 2
Type:G Protein-Coupled Receptor (GPCR)
Mol. Mass.:39690.94
Organism:Homo sapiens (Human)
Description:P34972
Residue:360
BDBM50302298
NameBDBM50302298
Synonyms:CHEMBL566456 | N-(5-methyl-4-(morpholinomethyl)pyridin-2-yl)pivalamide
TypeSmall organic molecule
Emp. Form.C16H25N3O2
Mol. Mass.291.3886
SMILESCc1cnc(NC(=O)C(C)(C)C)cc1CN1CCOCC1