Reaction Details
TargetCannabinoid receptor 2
LigandBDBM50302299
Substrate/Competitorn/a
Meas. Tech.ChEMBL_596700 (CHEMBL1049670)
Ki 5.3±n/a nM
Citation Chu, GHSaeui, CTWorm, KWeaver, DGGoodman, AJBroadrup, RLCassel, JADeHaven, RNLaBuda, CJKoblish, MBrogdon, BSmith, SLe Bourdonnec, BDolle, RE Novel pyridine derivatives as potent and selective CB2 cannabinoid receptor agonists. Bioorg Med Chem Lett19:5931-5 (2009) 
 
Cannabinoid receptor 2
Name:Cannabinoid receptor 2
Type:G Protein-Coupled Receptor (GPCR)
Mol. Mass.:39690.94
Organism:Homo sapiens (Human)
Description:P34972
Residue:360
BDBM50302299
NameBDBM50302299
Synonyms:2,2-dimethyl-N-(5-methyl-4-(morpholinomethyl)pyridin-2-yl)pentanamide | CHEMBL566057
TypeSmall organic molecule
Emp. Form.C18H29N3O2
Mol. Mass.319.4418
SMILESCCCC(C)(C)C(=O)Nc1cc(CN2CCOCC2)c(C)cn1