Reaction Details
TargetCannabinoid receptor 2
LigandBDBM50302302
Substrate/Competitorn/a
Meas. Tech.ChEMBL_596700 (CHEMBL1049670)
Ki 13±n/a nM
Citation Chu, GHSaeui, CTWorm, KWeaver, DGGoodman, AJBroadrup, RLCassel, JADeHaven, RNLaBuda, CJKoblish, MBrogdon, BSmith, SLe Bourdonnec, BDolle, RE Novel pyridine derivatives as potent and selective CB2 cannabinoid receptor agonists. Bioorg Med Chem Lett19:5931-5 (2009) 
 
Cannabinoid receptor 2
Name:Cannabinoid receptor 2
Type:G Protein-Coupled Receptor (GPCR)
Mol. Mass.:39690.94
Organism:Homo sapiens (Human)
Description:P34972
Residue:360
BDBM50302302
NameBDBM50302302
Synonyms:1-ethyl-N-(5-methyl-4-(morpholinomethyl)pyridin-2-yl)cyclopentanecarboxamide | CHEMBL567731
TypeSmall organic molecule
Emp. Form.C19H29N3O2
Mol. Mass.331.4525
SMILESCCC1(CCCC1)C(=O)Nc1cc(CN2CCOCC2)c(C)cn1