Reaction Details
TargetCannabinoid receptor 1
LigandBDBM50302305
Substrate/Competitorn/a
Meas. Tech.ChEMBL_596698 (CHEMBL1049668)
Ki 3800±n/a nM
Citation Chu, GHSaeui, CTWorm, KWeaver, DGGoodman, AJBroadrup, RLCassel, JADeHaven, RNLaBuda, CJKoblish, MBrogdon, BSmith, SLe Bourdonnec, BDolle, RE Novel pyridine derivatives as potent and selective CB2 cannabinoid receptor agonists. Bioorg Med Chem Lett19:5931-5 (2009) 
 
Cannabinoid receptor 1
Name:Cannabinoid receptor 1
Type:G Protein-Coupled Receptor (GPCR)
Mol. Mass.:52868.96
Organism:Homo sapiens (Human)
Description:P21554
Residue:472
BDBM50302305
NameBDBM50302305
Synonyms:2,2-dimethyl-N-(5-methyl-4-(morpholinomethyl)pyridin-2-yl)butanamide | CHEMBL566248
TypeSmall organic molecule
Emp. Form.C17H27N3O2
Mol. Mass.305.4152
SMILESCCC(C)(C)C(=O)Nc1cc(CN2CCOCC2)c(C)cn1