Reaction Details
TargetPotassium voltage-gated channel subfamily H member 2
LigandBDBM50302326
Substrate/Competitorn/a
Meas. Tech.ChEMBL_596933 (CHEMBL1048874)
Ki 1600±n/a nM
Citation Andrews, MBrown, AChiva, JYFradet, DGordon, DLansdell, MMacKenny, M Design and optimisation of selective serotonin re-uptake inhibitors with high synthetic accessibility: part 2. Bioorg Med Chem Lett19:5893-7 (2009) 
 
Potassium voltage-gated channel subfamily H member 2
Name:Potassium voltage-gated channel subfamily H member 2
Type:Multi-pass membrane protein
Mol. Mass.:126672.65
Organism:Homo sapiens (Human)
Description:Q12809
Residue:1159
BDBM50302326
NameBDBM50302326
Synonyms:(R)-N-((6-fluoro-1-methylnaphthalen-2-yl)methyl)-N-(pyrrolidin-3-yl)methanesulfonamide | CHEMBL576821
TypeSmall organic molecule
Emp. Form.C17H21FN2O2S
Mol. Mass.336.424
SMILESCc1c(CN([C@@H]2CCNC2)S(C)(=O)=O)ccc2cc(F)ccc12