Reaction Details
TargetCannabinoid receptor 2
LigandBDBM50302378
Substrate/Competitorn/a
Meas. Tech.ChEMBL_597137 (CHEMBL1048892)
EC50 14±n/a nM
Citation Giblin, GMBillinton, ABriggs, MBrown, AJChessell, IPClayton, NMEatherton, AJGoldsmith, PHaslam, CJohnson, MRMitchell, WLNaylor, APerboni, ASlingsby, BPWilson, AW Discovery of 1-[4-(3-chlorophenylamino)-1-methyl-1H-pyrrolo[3,2-c]pyridin-7-yl]-1-morpholin-4-ylmethanone (GSK554418A), a brain penetrant 5-azaindole CB2 agonist for the treatment of chronic pain. J Med Chem52:5785-8 (2009) 
 
Cannabinoid receptor 2
Name:Cannabinoid receptor 2
Type:G Protein-Coupled Receptor (GPCR)
Mol. Mass.:39690.94
Organism:Homo sapiens (Human)
Description:P34972
Residue:360
BDBM50302378
NameBDBM50302378
Synonyms:1-[7-(3-Chloro-phenylamino)-3-methyl-1H-pyrrolo[2,3-c]pyridin-4-yl]-1-piperidin-1-yl-methanone | CHEMBL585580
TypeSmall organic molecule
Emp. Form.C20H21ClN4O
Mol. Mass.368.86
SMILESCc1c[nH]c2c(Nc3cccc(Cl)c3)ncc(C(=O)N3CCCCC3)c12