Reaction Details
TargetCannabinoid receptor 2
LigandBDBM50302379
Substrate/Competitorn/a
Meas. Tech.ChEMBL_597137 (CHEMBL1048892)
EC50 107±n/a nM
Citation Giblin, GMBillinton, ABriggs, MBrown, AJChessell, IPClayton, NMEatherton, AJGoldsmith, PHaslam, CJohnson, MRMitchell, WLNaylor, APerboni, ASlingsby, BPWilson, AW Discovery of 1-[4-(3-chlorophenylamino)-1-methyl-1H-pyrrolo[3,2-c]pyridin-7-yl]-1-morpholin-4-ylmethanone (GSK554418A), a brain penetrant 5-azaindole CB2 agonist for the treatment of chronic pain. J Med Chem52:5785-8 (2009) 
 
Cannabinoid receptor 2
Name:Cannabinoid receptor 2
Type:G Protein-Coupled Receptor (GPCR)
Mol. Mass.:39690.94
Organism:Homo sapiens (Human)
Description:P34972
Residue:360
BDBM50302379
NameBDBM50302379
Synonyms:1-Azepan-1-yl-1-[7-(3-chloro-phenylamino)-3-methyl-H-pyrrolo[2,3-c]pyridin-4-yl]-methanone | CHEMBL568339
TypeSmall organic molecule
Emp. Form.C21H23ClN4O
Mol. Mass.382.887
SMILESCc1c[nH]c2c(Nc3cccc(Cl)c3)ncc(C(=O)N3CCCCCC3)c12