Reaction Details
TargetCannabinoid receptor 2
LigandBDBM50302382
Substrate/Competitorn/a
Meas. Tech.ChEMBL_597137 (CHEMBL1048892)
EC50 4667±n/a nM
Citation Giblin, GMBillinton, ABriggs, MBrown, AJChessell, IPClayton, NMEatherton, AJGoldsmith, PHaslam, CJohnson, MRMitchell, WLNaylor, APerboni, ASlingsby, BPWilson, AW Discovery of 1-[4-(3-chlorophenylamino)-1-methyl-1H-pyrrolo[3,2-c]pyridin-7-yl]-1-morpholin-4-ylmethanone (GSK554418A), a brain penetrant 5-azaindole CB2 agonist for the treatment of chronic pain. J Med Chem52:5785-8 (2009) 
 
Cannabinoid receptor 2
Name:Cannabinoid receptor 2
Type:G Protein-Coupled Receptor (GPCR)
Mol. Mass.:39690.94
Organism:Homo sapiens (Human)
Description:P34972
Residue:360
BDBM50302382
NameBDBM50302382
Synonyms:CHEMBL578371 | N-3-pentyl-4-(4-morpholinylcarbonyl)-1H-pyrrolo[2,3-c]pyridin-7-amine
TypeSmall organic molecule
Emp. Form.C18H26N4O2
Mol. Mass.330.4246
SMILESCCC(CC)Nc1ncc(C(=O)N2CCOCC2)c2c(C)c[nH]c12