Reaction Details
TargetP2Y purinoceptor 12
LigandBDBM50302435
Substrate/Competitorn/a
Meas. Tech.ChEMBL_597609 (CHEMBL1050572)
Ki 4400±n/a nM
Citation Kortum, SWLachance, RMSchweitzer, BAYalamanchili, GRahman, HEnnis, MDHuff, RMTenBrink, RE Thienopyrimidine-based P2Y12 platelet aggregation inhibitors. Bioorg Med Chem Lett19:5919-23 (2009) 
 
P2Y purinoceptor 12
Name:P2Y purinoceptor 12
Type:Enzyme
Mol. Mass.:39458.48
Organism:Homo sapiens (Human)
Description:Q9H244
Residue:342
BDBM50302435
NameBDBM50302435
Synonyms:(4-(6-ethylthieno[2,3-d]pyrimidin-4-yl)piperazin-1-yl)(phenyl)methanone | CHEMBL568126
TypeSmall organic molecule
Emp. Form.C19H20N4OS
Mol. Mass.352.453
SMILESCCc1cc2c(ncnc2s1)N1CCN(CC1)C(=O)c1ccccc1