Reaction Details
TargetP2Y purinoceptor 12
LigandBDBM50302443
Substrate/Competitorn/a
Meas. Tech.ChEMBL_597609 (CHEMBL1050572)
Ki 191±n/a nM
Citation Kortum, SWLachance, RMSchweitzer, BAYalamanchili, GRahman, HEnnis, MDHuff, RMTenBrink, RE Thienopyrimidine-based P2Y12 platelet aggregation inhibitors. Bioorg Med Chem Lett19:5919-23 (2009) 
 
P2Y purinoceptor 12
Name:P2Y purinoceptor 12
Type:Enzyme
Mol. Mass.:39458.48
Organism:Homo sapiens (Human)
Description:Q9H244
Residue:342
BDBM50302443
NameBDBM50302443
Synonyms:3-(3-(6-ethyl-4-(4-(2-(3-methoxyphenoxy)acetyl)piperazin-1-yl)thieno[2,3-d]pyrimidin-2-yl)ureido)propanoic acid | CHEMBL567502
TypeSmall organic molecule
Emp. Form.C25H30N6O6S
Mol. Mass.542.607
SMILESCCc1cc2c(nc(NC(=O)NCCC(O)=O)nc2s1)N1CCN(CC1)C(=O)COc1cccc(OC)c1