Reaction Details
TargetBifunctional epoxide hydrolase 2
LigandBDBM50302462
Substrate/Competitorn/a
Meas. Tech.ChEMBL_597619 (CHEMBL1039071)
IC50 0.1±n/a nM
Citation Taylor, SJSoleymanzadeh, FEldrup, ABFarrow, NAMuegge, IKukulka, AKabcenell, AKDe Lombaert, S Design and synthesis of substituted nicotinamides as inhibitors of soluble epoxide hydrolase. Bioorg Med Chem Lett19:5864-8 (2009) 
 
Bifunctional epoxide hydrolase 2
Name:Bifunctional epoxide hydrolase 2
Type:Enzyme
Mol. Mass.:62613.07
Organism:Homo sapiens (Human)
Description:P34913
Residue:555
BDBM50302462
NameBDBM50302462
Synonyms:CHEMBL566648 | N-(4-bromo-2-(trifluoromethoxy)benzyl)-6-(3,3,3-trifluoropropoxy)nicotinamide
TypeSmall organic molecule
Emp. Form.C17H13BrF6N2O3
Mol. Mass.487.191
SMILESFC(F)(F)CCOc1ccc(cn1)C(=O)NCc1ccc(Br)cc1OC(F)(F)F