Reaction Details
TargetProtein kinase C theta type
LigandBDBM50302512
Substrate/Competitorn/a
Meas. Tech.ChEMBL_597635 (CHEMBL1039087)
IC50 1400±n/a nM
Citation Niu, CBoschelli, DHTumey, LNBhagirath, NSubrath, JShim, JWang, YWu, BEid, CLee, JYang, XBrennan, AChaudhary, D First generation 5-vinyl-3-pyridinecarbonitrile PKCtheta inhibitors. Bioorg Med Chem Lett19:5829-32 (2009) 
 
Protein kinase C theta type
Name:Protein kinase C theta type
Type:Serine/threonine-protein kinase
Mol. Mass.:81878.04
Organism:Homo sapiens (Human)
Description:Full-length human PKC theta (Panvera Catalog No. P2996).
Residue:706
BDBM50302512
NameBDBM50302512
Synonyms:4-(1H-indol-6-ylamino)-5-styrylnicotinonitrile | CHEMBL578348
TypeSmall organic molecule
Emp. Form.C22H16N4
Mol. Mass.336.3892
SMILESN#Cc1cncc(\C=C\c2ccccc2)c1Nc1ccc2cc[nH]c2c1