Reaction Details
TargetProtein kinase C theta type
LigandBDBM50302513
Substrate/Competitorn/a
Meas. Tech.ChEMBL_597635 (CHEMBL1039087)
IC50 4700±n/a nM
Citation Niu, CBoschelli, DHTumey, LNBhagirath, NSubrath, JShim, JWang, YWu, BEid, CLee, JYang, XBrennan, AChaudhary, D First generation 5-vinyl-3-pyridinecarbonitrile PKCtheta inhibitors. Bioorg Med Chem Lett19:5829-32 (2009) 
 
Protein kinase C theta type
Name:Protein kinase C theta type
Type:Serine/threonine-protein kinase
Mol. Mass.:81878.04
Organism:Homo sapiens (Human)
Description:Full-length human PKC theta (Panvera Catalog No. P2996).
Residue:706
BDBM50302513
NameBDBM50302513
Synonyms:4-(1-methyl-1H-indol-5-ylamino)-5-styrylnicotinonitrile | CHEMBL568186
TypeSmall organic molecule
Emp. Form.C23H18N4
Mol. Mass.350.4158
SMILESCn1ccc2cc(Nc3c(\C=C\c4ccccc4)cncc3C#N)ccc12