Reaction Details
TargetProtein kinase C theta type
LigandBDBM50302518
Substrate/Competitorn/a
Meas. Tech.ChEMBL_597635 (CHEMBL1039087)
IC50 65±n/a nM
Citation Niu, CBoschelli, DHTumey, LNBhagirath, NSubrath, JShim, JWang, YWu, BEid, CLee, JYang, XBrennan, AChaudhary, D First generation 5-vinyl-3-pyridinecarbonitrile PKCtheta inhibitors. Bioorg Med Chem Lett19:5829-32 (2009) 
 
Protein kinase C theta type
Name:Protein kinase C theta type
Type:Serine/threonine-protein kinase
Mol. Mass.:81878.04
Organism:Homo sapiens (Human)
Description:Full-length human PKC theta (Panvera Catalog No. P2996).
Residue:706
BDBM50302518
NameBDBM50302518
Synonyms:4-(6-chloro-1H-indol-5-ylamino)-5-styrylnicotinonitrile | CHEMBL578169
TypeSmall organic molecule
Emp. Form.C22H15ClN4
Mol. Mass.370.834
SMILESClc1cc2[nH]ccc2cc1Nc1c(\C=C\c2ccccc2)cncc1C#N