Reaction Details
TargetProtein kinase C theta type
LigandBDBM50302530
Substrate/Competitorn/a
Meas. Tech.ChEMBL_597635 (CHEMBL1039087)
IC50 13±n/a nM
Citation Niu, CBoschelli, DHTumey, LNBhagirath, NSubrath, JShim, JWang, YWu, BEid, CLee, JYang, XBrennan, AChaudhary, D First generation 5-vinyl-3-pyridinecarbonitrile PKCtheta inhibitors. Bioorg Med Chem Lett19:5829-32 (2009) 
 
Protein kinase C theta type
Name:Protein kinase C theta type
Type:Serine/threonine-protein kinase
Mol. Mass.:81878.04
Organism:Homo sapiens (Human)
Description:Full-length human PKC theta (Panvera Catalog No. P2996).
Residue:706
BDBM50302530
NameBDBM50302530
Synonyms:4-(4-methyl-1H-indol-5-ylamino)-5-(2-(2-(pyrrolidin-1-yl)ethoxy)styryl)nicotinonitrile | CHEMBL583879
TypeSmall organic molecule
Emp. Form.C29H29N5O
Mol. Mass.463.5735
SMILESCc1c(Nc2c(\C=C\c3ccccc3OCCN3CCCC3)cncc2C#N)ccc2[nH]ccc12