Reaction Details
TargetProtein kinase C delta type
LigandBDBM50302511
Substrate/Competitorn/a
Meas. Tech.ChEMBL_597636 (CHEMBL1039088)
IC50 96±n/a nM
Citation Niu, CBoschelli, DHTumey, LNBhagirath, NSubrath, JShim, JWang, YWu, BEid, CLee, JYang, XBrennan, AChaudhary, D First generation 5-vinyl-3-pyridinecarbonitrile PKCtheta inhibitors. Bioorg Med Chem Lett19:5829-32 (2009) 
 
Protein kinase C delta type
Name:Protein kinase C delta type
Type:Enzyme
Mol. Mass.:77516.79
Organism:Homo sapiens (Human)
Description:The recombinant human PKC enzymes were produced using a baculovirus expression system in SF9 cells
Residue:676
BDBM50302511
NameBDBM50302511
Synonyms:4-(3H-indol-4-ylamino)-5-styrylnicotinonitrile | CHEMBL576232
TypeSmall organic molecule
Emp. Form.C22H16N4
Mol. Mass.336.3892
SMILESN#Cc1cncc(C=Cc2ccccc2)c1Nc1cccc2[nH]ccc12