Reaction Details
TargetProtein kinase C delta type
LigandBDBM50302527
Substrate/Competitorn/a
Meas. Tech.ChEMBL_597636 (CHEMBL1039088)
IC50 150±n/a nM
Citation Niu, CBoschelli, DHTumey, LNBhagirath, NSubrath, JShim, JWang, YWu, BEid, CLee, JYang, XBrennan, AChaudhary, D First generation 5-vinyl-3-pyridinecarbonitrile PKCtheta inhibitors. Bioorg Med Chem Lett19:5829-32 (2009) 
 
Protein kinase C delta type
Name:Protein kinase C delta type
Type:Enzyme
Mol. Mass.:77516.79
Organism:Homo sapiens (Human)
Description:The recombinant human PKC enzymes were produced using a baculovirus expression system in SF9 cells
Residue:676
BDBM50302527
NameBDBM50302527
Synonyms:5-(4-methoxystyryl)-4-(4-methyl-1H-indol-5-ylamino)nicotinonitrile | CHEMBL566263
TypeSmall organic molecule
Emp. Form.C24H20N4O
Mol. Mass.380.4418
SMILESCOc1ccc(\C=C\c2cncc(C#N)c2Nc2ccc3[nH]ccc3c2C)cc1