Reaction Details
TargetProtein kinase C delta type
LigandBDBM50302528
Substrate/Competitorn/a
Meas. Tech.ChEMBL_597636 (CHEMBL1039088)
IC50 34±n/a nM
Citation Niu, CBoschelli, DHTumey, LNBhagirath, NSubrath, JShim, JWang, YWu, BEid, CLee, JYang, XBrennan, AChaudhary, D First generation 5-vinyl-3-pyridinecarbonitrile PKCtheta inhibitors. Bioorg Med Chem Lett19:5829-32 (2009) 
 
Protein kinase C delta type
Name:Protein kinase C delta type
Type:Enzyme
Mol. Mass.:77516.79
Organism:Homo sapiens (Human)
Description:The recombinant human PKC enzymes were produced using a baculovirus expression system in SF9 cells
Residue:676
BDBM50302528
NameBDBM50302528
Synonyms:4-(4-methyl-1H-indol-5-ylamino)-5-(2-(2-(4-methylpiperazin-1-yl)ethoxy)styryl)nicotinonitrile | CHEMBL567952
TypeSmall organic molecule
Emp. Form.C30H32N6O
Mol. Mass.492.6147
SMILESCN1CCN(CCOc2ccccc2\C=C\c2cncc(C#N)c2Nc2ccc3[nH]ccc3c2C)CC1