Reaction Details
TargetCorticotropin-releasing factor receptor 1
LigandBDBM50302582
Substrate/Competitorn/a
Meas. Tech.ChEMBL_594612 (CHEMBL1037909)
Ki 35±n/a nM
Citation Miller, DCKlute, WCalabrese, ABrown, AD Optimising metabolic stability in lipophilic chemical space: the identification of a metabolically stable pyrazolopyrimidine CRF-1 receptor antagonist. Bioorg Med Chem Lett19:6144-7 (2009) 
 
Corticotropin-releasing factor receptor 1
Name:Corticotropin-releasing factor receptor 1
Type:Enzyme
Mol. Mass.:50744.31
Organism:Homo sapiens (Human)
Description:P34998
Residue:444
BDBM50302582
NameBDBM50302582
Synonyms:CHEMBL566279 | N-(heptan-4-yl)-1-(4-methoxy-2-methylphenyl)-3,6-dimethyl-1H-pyrazolo[3,4-d]pyrimidin-4-amine
TypeSmall organic molecule
Emp. Form.C22H31N5O
Mol. Mass.381.5144
SMILESCCCC(CCC)Nc1nc(C)nc2n(nc(C)c12)-c1ccc(OC)cc1C