Reaction Details
TargetP2Y purinoceptor 12
LigandBDBM50302685
Substrate/Competitorn/a
Meas. Tech.ChEMBL_595036 (CHEMBL1042521)
Ki 0.92±n/a nM
Citation Parlow, JJBurney, MWCase, BLGirard, TJHall, KAHiebsch, RRHuff, RMLachance, RMMischke, DARapp, SRWoerndle, RSEnnis, MD Piperazinyl-glutamate-pyrimidines as potent P2Y12 antagonists for inhibition of platelet aggregation. Bioorg Med Chem Lett19:6148-56 (2009) 
 
P2Y purinoceptor 12
Name:P2Y purinoceptor 12
Type:Enzyme
Mol. Mass.:39458.48
Organism:Homo sapiens (Human)
Description:Q9H244
Residue:342
BDBM50302685
NameBDBM50302685
Synonyms:(S)-4-(6-(4-(2-(azetidin-1-yl)-2-oxoethyl)piperidin-1-yl)-2-phenylpyrimidine-4-carboxamido)-5-oxo-5-(4-(pentyloxycarbonyl)piperazin-1-yl)pentanoic acid | CHEMBL571599
TypeSmall organic molecule
Emp. Form.C36H49N7O7
Mol. Mass.691.817
SMILESCCCCCOC(=O)N1CCN(CC1)C(=O)[C@H](CCC(O)=O)NC(=O)c1cc(nc(n1)-c1ccccc1)N1CCC(CC(=O)N2CCC2)CC1