Reaction Details
TargetP2Y purinoceptor 12
LigandBDBM50302697
Substrate/Competitorn/a
Meas. Tech.ChEMBL_595037 (CHEMBL1042522)
IC50 490±n/a nM
Citation Parlow, JJBurney, MWCase, BLGirard, TJHall, KAHiebsch, RRHuff, RMLachance, RMMischke, DARapp, SRWoerndle, RSEnnis, MD Piperazinyl-glutamate-pyrimidines as potent P2Y12 antagonists for inhibition of platelet aggregation. Bioorg Med Chem Lett19:6148-56 (2009) 
 
P2Y purinoceptor 12
Name:P2Y purinoceptor 12
Type:Enzyme
Mol. Mass.:39458.48
Organism:Homo sapiens (Human)
Description:Q9H244
Residue:342
BDBM50302697
NameBDBM50302697
Synonyms:(S)-5-(4-(butoxycarbonyl)piperazin-1-yl)-4-(4-(4-(ethylcarbamoyl)piperidin-1-yl)-6-phenylpicolinamido)-5-oxopentanoic acid CHEMBL570295
TypeSmall organic molecule
Emp. Form.C34H46N6O7
Mol. Mass.650.765
SMILESCCCCOC(=O)N1CCN(CC1)C(=O)[C@H](CCC(O)=O)NC(=O)c1cc(cc(n1)-c1ccccc1)N1CCC(CC1)C(=O)NCC