Reaction Details
TargetP2Y purinoceptor 12
LigandBDBM50302718
Substrate/Competitorn/a
Meas. Tech.ChEMBL_595036 (CHEMBL1042521)
Ki 2.1±n/a nM
Citation Parlow, JJBurney, MWCase, BLGirard, TJHall, KAHiebsch, RRHuff, RMLachance, RMMischke, DARapp, SRWoerndle, RSEnnis, MD Piperazinyl-glutamate-pyrimidines as potent P2Y12 antagonists for inhibition of platelet aggregation. Bioorg Med Chem Lett19:6148-56 (2009) 
 
P2Y purinoceptor 12
Name:P2Y purinoceptor 12
Type:Enzyme
Mol. Mass.:39458.48
Organism:Homo sapiens (Human)
Description:Q9H244
Residue:342
BDBM50302718
NameBDBM50302718
Synonyms:(S)-5-oxo-5-(4-(pentyloxycarbonyl)piperazin-1-yl)-4-(2-phenyl-6-(4-(2-(pyrrolidin-1-yl)ethyl)piperidin-1-yl)pyrimidine-4-carboxamido)pentanoic acid | CHEMBL567280
TypeSmall organic molecule
Emp. Form.C37H53N7O6
Mol. Mass.691.86
SMILESCCCCCOC(=O)N1CCN(CC1)C(=O)[C@H](CCC(O)=O)NC(=O)c1cc(nc(n1)-c1ccccc1)N1CCC(CCN2CCCC2)CC1