Reaction Details
TargetP2Y purinoceptor 12
LigandBDBM50302644
Substrate/Competitorn/a
Meas. Tech.ChEMBL_595036 (CHEMBL1042521)
Ki 2±n/a nM
Citation Parlow, JJBurney, MWCase, BLGirard, TJHall, KAHiebsch, RRHuff, RMLachance, RMMischke, DARapp, SRWoerndle, RSEnnis, MD Piperazinyl-glutamate-pyrimidines as potent P2Y12 antagonists for inhibition of platelet aggregation. Bioorg Med Chem Lett19:6148-56 (2009) 
 
P2Y purinoceptor 12
Name:P2Y purinoceptor 12
Type:Enzyme
Mol. Mass.:39458.48
Organism:Homo sapiens (Human)
Description:Q9H244
Residue:342
BDBM50302644
NameBDBM50302644
Synonyms:(S)-5-oxo-5-(4-(pentyloxycarbonyl)piperazin-1-yl)-4-(2-phenyl-6-(piperazin-1-yl)pyrimidine-4-carboxamido)pentanoic acid | CHEMBL570093
TypeSmall organic molecule
Emp. Form.C30H41N7O6
Mol. Mass.595.6898
SMILESCCCCCOC(=O)N1CCN(CC1)C(=O)[C@H](CCC(O)=O)NC(=O)c1cc(nc(n1)-c1ccccc1)N1CCNCC1