Reaction Details
TargetP2Y purinoceptor 12
LigandBDBM50302677
Substrate/Competitorn/a
Meas. Tech.ChEMBL_595036 (CHEMBL1042521)
Ki 1.2±n/a nM
Citation Parlow, JJBurney, MWCase, BLGirard, TJHall, KAHiebsch, RRHuff, RMLachance, RMMischke, DARapp, SRWoerndle, RSEnnis, MD Piperazinyl-glutamate-pyrimidines as potent P2Y12 antagonists for inhibition of platelet aggregation. Bioorg Med Chem Lett19:6148-56 (2009) 
 
P2Y purinoceptor 12
Name:P2Y purinoceptor 12
Type:Enzyme
Mol. Mass.:39458.48
Organism:Homo sapiens (Human)
Description:Q9H244
Residue:342
BDBM50302677
NameBDBM50302677
Synonyms:(S)-4-(6-(2-methoxyethoxy)-2-phenylpyrimidine-4-carboxamido)-5-oxo-5-(4-(pentyloxycarbonyl)piperazin-1-yl)pentanoic acid | CHEMBL569679
TypeSmall organic molecule
Emp. Form.C29H39N5O8
Mol. Mass.585.6487
SMILESCCCCCOC(=O)N1CCN(CC1)C(=O)[C@H](CCC(O)=O)NC(=O)c1cc(OCCOC)nc(n1)-c1ccccc1