Reaction Details
TargetDelta-type opioid receptor
LigandBDBM50302763
Substrate/Competitorn/a
Meas. Tech.ChEMBL_595271 (CHEMBL1043623)
EC50 1.1±n/a nM
Citation Jones, PGriffin, AMGawell, LLavoie, RDelorme, DRoberts, EBrown, WWalpole, CXiao, WBoulet, JLabarre, MCoupal, MButterworth, JSt-Onge, SHodzic, LSalois, D N,N-Diethyl-4-[(3-hydroxyphenyl)(piperidin-4-yl)amino] benzamide derivatives: the development of diaryl amino piperidines as potent delta opioid receptor agonists with in vivo anti-nociceptive activity in rodent models. Bioorg Med Chem Lett19:5994-8 (2009) 
 
Delta-type opioid receptor
Name:Delta-type opioid receptor
Type:G Protein-Coupled Receptor (GPCR)
Mol. Mass.:40382.98
Organism:Homo sapiens (Human)
Description:Competition binding assays were carried out using membrane preparations from transfected HN9.10 cells that constitutively expressed the delta opioid receptor.
Residue:372
BDBM50302763
NameBDBM50302763
Synonyms:CHEMBL569728 | N,N-diethyl-4-((3-hydroxyphenyl)(1-(4-methylphenethyl)piperidin-4-yl)amino)benzamide
TypeSmall organic molecule
Emp. Form.C31H39N3O2
Mol. Mass.485.6603
SMILESCCN(CC)C(=O)c1ccc(cc1)N(C1CCN(CCc2ccc(C)cc2)CC1)c1cccc(O)c1