Reaction Details
TargetDelta-type opioid receptor
LigandBDBM50302778
Substrate/Competitorn/a
Meas. Tech.ChEMBL_595271 (CHEMBL1043623)
EC50 15±n/a nM
Citation Jones, PGriffin, AMGawell, LLavoie, RDelorme, DRoberts, EBrown, WWalpole, CXiao, WBoulet, JLabarre, MCoupal, MButterworth, JSt-Onge, SHodzic, LSalois, D N,N-Diethyl-4-[(3-hydroxyphenyl)(piperidin-4-yl)amino] benzamide derivatives: the development of diaryl amino piperidines as potent delta opioid receptor agonists with in vivo anti-nociceptive activity in rodent models. Bioorg Med Chem Lett19:5994-8 (2009) 
 
Delta-type opioid receptor
Name:Delta-type opioid receptor
Type:G Protein-Coupled Receptor (GPCR)
Mol. Mass.:40382.98
Organism:Homo sapiens (Human)
Description:Competition binding assays were carried out using membrane preparations from transfected HN9.10 cells that constitutively expressed the delta opioid receptor.
Residue:372
BDBM50302778
NameBDBM50302778
Synonyms:CHEMBL570448 | N,N-diethyl-4-((3-hydroxyphenyl)(1-(2-(1-methyl-1H-imidazol-2-yl)ethyl)piperidin-4-yl)amino)benzamide
TypeSmall organic molecule
Emp. Form.C28H37N5O2
Mol. Mass.475.6257
SMILESCCN(CC)C(=O)c1ccc(cc1)N(C1CCN(CCc2nccn2C)CC1)c1cccc(O)c1