Reaction Details
TargetKappa-type opioid receptor
LigandBDBM50302756
Substrate/Competitorn/a
Meas. Tech.ChEMBL_595268 (CHEMBL1043620)
Ki 1189±n/a nM
Citation Jones, PGriffin, AMGawell, LLavoie, RDelorme, DRoberts, EBrown, WWalpole, CXiao, WBoulet, JLabarre, MCoupal, MButterworth, JSt-Onge, SHodzic, LSalois, D N,N-Diethyl-4-[(3-hydroxyphenyl)(piperidin-4-yl)amino] benzamide derivatives: the development of diaryl amino piperidines as potent delta opioid receptor agonists with in vivo anti-nociceptive activity in rodent models. Bioorg Med Chem Lett19:5994-8 (2009) 
 
Kappa-type opioid receptor
Name:Kappa-type opioid receptor
Type:G Protein-Coupled Receptor (GPCR)
Mol. Mass.:42648.76
Organism:Homo sapiens (Human)
Description:P41145
Residue:380
BDBM50302756
NameBDBM50302756
Synonyms:4-((1-(2-(1H-imidazol-2-yl)ethyl)piperidin-4-yl)(3-hydroxyphenyl)amino)-N,N-diethylbenzamide | CHEMBL569956
TypeSmall organic molecule
Emp. Form.C27H35N5O2
Mol. Mass.461.5991
SMILESCCN(CC)C(=O)c1ccc(cc1)N(C1CCN(CCc2ncc[nH]2)CC1)c1cccc(O)c1