Reaction Details
TargetMu-type opioid receptor
LigandBDBM50302772
Substrate/Competitorn/a
Meas. Tech.ChEMBL_595267 (CHEMBL1043619)
Ki 2533±n/a nM
Citation Jones, PGriffin, AMGawell, LLavoie, RDelorme, DRoberts, EBrown, WWalpole, CXiao, WBoulet, JLabarre, MCoupal, MButterworth, JSt-Onge, SHodzic, LSalois, D N,N-Diethyl-4-[(3-hydroxyphenyl)(piperidin-4-yl)amino] benzamide derivatives: the development of diaryl amino piperidines as potent delta opioid receptor agonists with in vivo anti-nociceptive activity in rodent models. Bioorg Med Chem Lett19:5994-8 (2009) 
 
Mu-type opioid receptor
Name:Mu-type opioid receptor
Type:G Protein-Coupled Receptor (GPCR)
Mol. Mass.:44789.51
Organism:Homo sapiens (Human)
Description:P35372
Residue:400
BDBM50302772
NameBDBM50302772
Synonyms:CHEMBL570446 | N,N-diethyl-4-((1-(2-(furan-2-yl)ethyl)piperidin-4-yl)(3-methoxyphenyl)amino)benzamide
TypeSmall organic molecule
Emp. Form.C29H37N3O3
Mol. Mass.475.6224
SMILESCCN(CC)C(=O)c1ccc(cc1)N(C1CCN(CCc2ccco2)CC1)c1cccc(OC)c1