Reaction Details
TargetKappa-type opioid receptor
LigandBDBM50039029
Substrate/Competitorn/a
Meas. Tech.ChEMBL_595268 (CHEMBL1043620)
Ki 4169±n/a nM
Citation Jones, PGriffin, AMGawell, LLavoie, RDelorme, DRoberts, EBrown, WWalpole, CXiao, WBoulet, JLabarre, MCoupal, MButterworth, JSt-Onge, SHodzic, LSalois, D N,N-Diethyl-4-[(3-hydroxyphenyl)(piperidin-4-yl)amino] benzamide derivatives: the development of diaryl amino piperidines as potent delta opioid receptor agonists with in vivo anti-nociceptive activity in rodent models. Bioorg Med Chem Lett19:5994-8 (2009) 
 
Kappa-type opioid receptor
Name:Kappa-type opioid receptor
Type:G Protein-Coupled Receptor (GPCR)
Mol. Mass.:42648.76
Organism:Homo sapiens (Human)
Description:P41145
Residue:380
BDBM50039029
NameBDBM50039029
Synonyms:(+)-4-((alpha R)-((2S,5R)-4-allyl-2,5-dimethylpiperazin-1-yl)(3-methoxyphenyl)methyl)-N,N-diethylbenzamide 3-[(4-Allyl-2,5-dimethyl-piperazin-1-yl)-(4-diethylcarbamoyl-phenyl)-methyl]-benzoic acid 4-((R)-((2S,5R)-4-allyl-2,5-dimethylpiperazin-1-yl)(3-methoxyphenyl)methyl)-N,N-diethylbenzamide 4-[(4-Allyl-2,5-dimethyl-piperazin-1-yl)-(3-methoxy-phenyl)-methyl]-N,N-diethyl-benzamide (SNC 80) 4-[(R)-((2R,5S)-4-Allyl-2,5-dimethyl-piperazin-1-yl)-(3-methoxy-phenyl)-methyl]-N,N-diethyl-benzamide 4-[(R)-((R)-4-(S)-Allyl-2,5-dimethyl-piperazin-1-yl)-(3-methoxy-phenyl)-methyl]-N,N-diethyl-benzamide 4-[(R)-[(2S,5R)-4-allyl-2,5-dimethylpiperazin-1-yl](3-methoxyphenyl)-methyl]-N,N-diethylbenzamide SNC-80
TypeSmall organic molecule
Emp. Form.C28H39N3O2
Mol. Mass.449.6282
SMILESCCN(CC)C(=O)c1ccc(cc1)[C@@H](N1C[C@@H](C)N(CC=C)C[C@@H]1C)c1cccc(OC)c1