Reaction Details
TargetCalcitonin gene-related peptide type 1 receptor
LigandBDBM50302875
Substrate/Competitorn/a
Meas. Tech.ChEMBL_595485 (CHEMBL1046104)
Ki 6.6±n/a nM
Citation Burgey, CSPotteiger, CMDeng, JZMosser, SDSalvatore, CAYu, SRoller, SKane, SAVacca, JPWilliams, TM Optimization of azepanone calcitonin gene-related peptide (CGRP) receptor antagonists: development of novel spiropiperidines. Bioorg Med Chem Lett19:6368-72 (2009) 
 
Calcitonin gene-related peptide type 1 receptor
Name:Calcitonin gene-related peptide type 1 receptor
Type:Enzyme Catalytic Domain
Mol. Mass.:52980.45
Organism:Homo sapiens (Human)
Description:Q16602
Residue:461
BDBM50302875
NameBDBM50302875
Synonyms:CHEMBL570748 | N-((3R,6S)-6-(2,3-difluorophenyl)-2-oxo-1-(2,2,2-trifluoroethyl)azepan-3-yl)-4-(6-methyl-3-oxo-2,3-dihydropyridazin-4-yl)piperidine-1-carboxamide
TypeSmall organic molecule
Emp. Form.C25H28F5N5O3
Mol. Mass.541.5135
SMILESCc1cc(C2CCN(CC2)C(=O)N[C@@H]2CC[C@H](CN(CC(F)(F)F)C2=O)c2cccc(F)c2F)c(=O)[nH]n1