Reaction Details
TargetCalcitonin gene-related peptide type 1 receptor
LigandBDBM50302888
Substrate/Competitorn/a
Meas. Tech.ChEMBL_595485 (CHEMBL1046104)
Ki 240±n/a nM
Citation Burgey, CSPotteiger, CMDeng, JZMosser, SDSalvatore, CAYu, SRoller, SKane, SAVacca, JPWilliams, TM Optimization of azepanone calcitonin gene-related peptide (CGRP) receptor antagonists: development of novel spiropiperidines. Bioorg Med Chem Lett19:6368-72 (2009) 
 
Calcitonin gene-related peptide type 1 receptor
Name:Calcitonin gene-related peptide type 1 receptor
Type:Enzyme Catalytic Domain
Mol. Mass.:52980.45
Organism:Homo sapiens (Human)
Description:Q16602
Residue:461
BDBM50302888
NameBDBM50302888
Synonyms:CHEMBL570626 | N-((3R,6S)-6-(2,3-difluorophenyl)-2-oxo-1-(2,2,2-trifluoroethyl)azepan-3-yl)-4-(3-oxo-6-phenyl-2,3-dihydropyridazin-4-yl)piperidine-1-carboxamide
TypeSmall organic molecule
Emp. Form.C30H30F5N5O3
Mol. Mass.603.5829
SMILESFc1cccc([C@@H]2CC[C@@H](NC(=O)N3CCC(CC3)c3cc(n[nH]c3=O)-c3ccccc3)C(=O)N(CC(F)(F)F)C2)c1F