Reaction Details
TargetCalcitonin gene-related peptide type 1 receptor
LigandBDBM50302877
Substrate/Competitorn/a
Meas. Tech.ChEMBL_595485 (CHEMBL1046104)
Ki 41±n/a nM
Citation Burgey, CSPotteiger, CMDeng, JZMosser, SDSalvatore, CAYu, SRoller, SKane, SAVacca, JPWilliams, TM Optimization of azepanone calcitonin gene-related peptide (CGRP) receptor antagonists: development of novel spiropiperidines. Bioorg Med Chem Lett19:6368-72 (2009) 
 
Calcitonin gene-related peptide type 1 receptor
Name:Calcitonin gene-related peptide type 1 receptor
Type:Enzyme Catalytic Domain
Mol. Mass.:52980.45
Organism:Homo sapiens (Human)
Description:Q16602
Residue:461
BDBM50302877
NameBDBM50302877
Synonyms:CHEMBL572114 | N-((3R,6S)-6-(2,3-difluorophenyl)-2-oxo-1-(2,2,2-trifluoroethyl)azepan-3-yl)-1,3-dioxo-2,8-diazaspiro[4.5]decane-8-carboxamide
TypeSmall organic molecule
Emp. Form.C23H25F5N4O4
Mol. Mass.516.461
SMILESFc1cccc([C@@H]2CC[C@@H](NC(=O)N3CCC4(CC(=O)NC4=O)CC3)C(=O)N(CC(F)(F)F)C2)c1F